새로운 글
새로운 덧글

자유롭게 질의 및 응답을 할 수 있는 게시판이며 어느 누구도 답변을 달아야만 하는 의무는 없습니다. 
  • 제품설치/등록/제품 오류 문의: 설치/등록 Q&A 이용 (제품 구매 고객 한정)

Checking project dependencies...
Compiling ScannerMapp.dproj (Debug, Win32)
[Warning Warning] Checking GetIt package dependencies
[MSBuild Error] The "GetItCmd" task failed unexpectedly.
System.NullReferenceException: Object reference not set to an instance of an object.
   at Borland.Build.Tasks.Common.CommandLineTask.Execute()
   at Borland.Build.Tasks.Shared.GetItCmd.Execute()
   at Microsoft.Build.BuildEngine.TaskEngine.ExecuteInstantiatedTask(EngineProxy engineProxy, ItemBucket bucket, TaskExecutionMode howToExecuteTask, ITask task, Boolean& taskResult)
Failed
Elapsed time: 00:00:00.9

 

 

Project "D:\SOURCE\MobilePos\ScannerMApp-master\ScannerMApp-master\ScannerMapp.dproj" (Make target(s)):
Target _CheckGetItPackageDependencies:
    Target _ExecGetItCmd:
        c:\program files (x86)\embarcadero\studio\19.0\bin\CodeGear.Common.Targets : warning : Checking GetIt package dependencies
        c:\program files (x86)\embarcadero\studio\19.0\bin\CodeGear.Common.Targets(305,5): error MSB4018: The "GetItCmd" task failed unexpectedly.
        c:\program files (x86)\embarcadero\studio\19.0\bin\CodeGear.Common.Targets(305,5): error MSB4018: System.NullReferenceException: Object reference not set to an instance of an object.
        c:\program files (x86)\embarcadero\studio\19.0\bin\CodeGear.Common.Targets(305,5): error MSB4018:    at Borland.Build.Tasks.Common.CommandLineTask.Execute()
        c:\program files (x86)\embarcadero\studio\19.0\bin\CodeGear.Common.Targets(305,5): error MSB4018:    at Borland.Build.Tasks.Shared.GetItCmd.Execute()
        c:\program files (x86)\embarcadero\studio\19.0\bin\CodeGear.Common.Targets(305,5): error MSB4018:    at Microsoft.Build.BuildEngine.TaskEngine.ExecuteInstantiatedTask(EngineProxy engineProxy, ItemBucket bucket, TaskExecutionMode howToExecuteTask, ITask task, Boolean& taskResult)
    Done building target "_ExecGetItCmd" in project "ScannerMapp.dproj" -- FAILED.
Done building target "_CheckGetItPackageDependencies" in project "ScannerMapp.dproj" -- FAILED.
Done building project "ScannerMapp.dproj" -- FAILED.
Build FAILED.
c:\program files (x86)\embarcadero\studio\19.0\bin\CodeGear.Common.Targets : warning : Checking GetIt package dependencies
c:\program files (x86)\embarcadero\studio\19.0\bin\CodeGear.Common.Targets(305,5): error MSB4018: The "GetItCmd" task failed unexpectedly.
c:\program files (x86)\embarcadero\studio\19.0\bin\CodeGear.Common.Targets(305,5): error MSB4018: System.NullReferenceException: Object reference not set to an instance of an object.
c:\program files (x86)\embarcadero\studio\19.0\bin\CodeGear.Common.Targets(305,5): error MSB4018:    at Borland.Build.Tasks.Common.CommandLineTask.Execute()
c:\program files (x86)\embarcadero\studio\19.0\bin\CodeGear.Common.Targets(305,5): error MSB4018:    at Borland.Build.Tasks.Shared.GetItCmd.Execute()
c:\program files (x86)\embarcadero\studio\19.0\bin\CodeGear.Common.Targets(305,5): error MSB4018:    at Microsoft.Build.BuildEngine.TaskEngine.ExecuteInstantiatedTask(EngineProxy engineProxy, ItemBucket bucket, TaskExecutionMode howToExecuteTask, ITask task, Boolean& taskResult)
    1 Warning(s)
    1 Error(s)
Time Elapsed 00:00:00.29

 

본 게시판은 개발자들이 자유롭게 질문과 답변을 공유하는 게시판입니다.
* 따라서 최대한 정중하게 질문을 올려 주세요.
* 질문을 상세히 작성해 주실 수록 좋은 답변이 올라 옵니다.
* 다른 분들도 참고할 수 있도록 결과 댓글 필수(또는 감사 댓글)
(결과 댓글을 달지 않는 경우 다음 질문에 대한 답변이 달리지 않는 불이익이 있을 수 있습니다.)
-----------------------------------------------------------------------------------------------

 

번호 제목 글쓴이 날짜 조회 수
공지 [프로그래밍 강의] 2019.8~2019.12 관리자 2015.01.22 9014
공지 유용한 관련 사이트 관리자2 2014.03.20 46460
공지 본 게시판은 개발자 여러분들의 질문과 답변을 공유하는 공간입니다. 관리자 2012.01.10 87470
2788 datasnap 이용하여 sqlconnection 이용하여 데이타를 모방일에서 가져오는데. 종결자 2019.12.01 37
2787 TEdit를 반투명하게 입력을 받고싶습니다 헨씀히포 2019.12.01 35
2786 ClientDataSet 이 연결오류 file 우기여니아빠 2019.11.29 26
2785 데이터스냅 사용자 인증 devdev 2019.11.29 39
2784 10.3.3 64-Bit deploy시 에러 [4] air 2019.11.28 70
2783 [에러] ISO C++17 does not allow 'register' storage class specifier [2] file lamp 2019.11.29 32
2782 TSaveEvent로 jpg저장하는 기능관련 문의의 글 [1] file 영우CnI 2019.11.28 31
2781 datasnap 이용하여 모바일 개발할때 [7] 종결자 2019.11.27 52
2780 blob 데이타 가져올때. [2] 종결자 2019.11.24 57
2779 질문 드립니다..TDBGrid 에 이미지 넣을려고 합니다.. [3] 초보델팡이 2019.11.26 47
2778 Open ssl 과 indy 관련 질문입니다. [8] 현수막 2019.01.23 288
2777 혹시 LIN통신 해보신분 계신가요.. [1] 공감 2019.11.22 71
2776 바코드스캔이 넘느려서 질문드립니다 [1] 화현 2019.11.23 82
2775 파이어몽키 모바일 TEDIT 스캐너로 입력시 속도개선 방법 문의드립니다. [5] 파이어버드 2017.05.02 235
2774 REST API 컴포넌트 설치와 클라이언트 개발 문의드립니다 [1] 가나다 2019.11.22 61
2773 데이터스냅 한글 인코딩 질문입니다. [1] file devdev 2019.11.21 54
2772 안드로이드 64비트 대응관련 문의드립니다. [3] 돌팅 2019.11.26 53
2771 [bcc32c Error] GdiplusPath.h(146) reference to 'byte' is ambiguous [2] 하루 2019.11.15 83
2770 개발자 기술자료 중 Firebase 안드로이드 앱 푸쉬 알림 - 10.3.2에서 FCM 전송 설정 - 실행시 오류 발생 [5] file 비앤케이 2019.10.19 218
2769 Fast Report 관련 문의 [1] 쿤이 2019.11.22 44



광고 모듈이 설치되어 있지 않아 실행을 중단합니다..