새로운 글
새로운 덧글

자유롭게 질의 및 응답을 할 수 있는 게시판이며 어느 누구도 답변을 달아야만 하는 의무는 없습니다. 
  • 제품설치/등록/제품 오류 문의: 설치/등록 Q&A 이용 (제품 구매 고객 한정)

Checking project dependencies...
Compiling ScannerMapp.dproj (Debug, Win32)
[Warning Warning] Checking GetIt package dependencies
[MSBuild Error] The "GetItCmd" task failed unexpectedly.
System.NullReferenceException: Object reference not set to an instance of an object.
   at Borland.Build.Tasks.Common.CommandLineTask.Execute()
   at Borland.Build.Tasks.Shared.GetItCmd.Execute()
   at Microsoft.Build.BuildEngine.TaskEngine.ExecuteInstantiatedTask(EngineProxy engineProxy, ItemBucket bucket, TaskExecutionMode howToExecuteTask, ITask task, Boolean& taskResult)
Failed
Elapsed time: 00:00:00.9

 

 

Project "D:\SOURCE\MobilePos\ScannerMApp-master\ScannerMApp-master\ScannerMapp.dproj" (Make target(s)):
Target _CheckGetItPackageDependencies:
    Target _ExecGetItCmd:
        c:\program files (x86)\embarcadero\studio\19.0\bin\CodeGear.Common.Targets : warning : Checking GetIt package dependencies
        c:\program files (x86)\embarcadero\studio\19.0\bin\CodeGear.Common.Targets(305,5): error MSB4018: The "GetItCmd" task failed unexpectedly.
        c:\program files (x86)\embarcadero\studio\19.0\bin\CodeGear.Common.Targets(305,5): error MSB4018: System.NullReferenceException: Object reference not set to an instance of an object.
        c:\program files (x86)\embarcadero\studio\19.0\bin\CodeGear.Common.Targets(305,5): error MSB4018:    at Borland.Build.Tasks.Common.CommandLineTask.Execute()
        c:\program files (x86)\embarcadero\studio\19.0\bin\CodeGear.Common.Targets(305,5): error MSB4018:    at Borland.Build.Tasks.Shared.GetItCmd.Execute()
        c:\program files (x86)\embarcadero\studio\19.0\bin\CodeGear.Common.Targets(305,5): error MSB4018:    at Microsoft.Build.BuildEngine.TaskEngine.ExecuteInstantiatedTask(EngineProxy engineProxy, ItemBucket bucket, TaskExecutionMode howToExecuteTask, ITask task, Boolean& taskResult)
    Done building target "_ExecGetItCmd" in project "ScannerMapp.dproj" -- FAILED.
Done building target "_CheckGetItPackageDependencies" in project "ScannerMapp.dproj" -- FAILED.
Done building project "ScannerMapp.dproj" -- FAILED.
Build FAILED.
c:\program files (x86)\embarcadero\studio\19.0\bin\CodeGear.Common.Targets : warning : Checking GetIt package dependencies
c:\program files (x86)\embarcadero\studio\19.0\bin\CodeGear.Common.Targets(305,5): error MSB4018: The "GetItCmd" task failed unexpectedly.
c:\program files (x86)\embarcadero\studio\19.0\bin\CodeGear.Common.Targets(305,5): error MSB4018: System.NullReferenceException: Object reference not set to an instance of an object.
c:\program files (x86)\embarcadero\studio\19.0\bin\CodeGear.Common.Targets(305,5): error MSB4018:    at Borland.Build.Tasks.Common.CommandLineTask.Execute()
c:\program files (x86)\embarcadero\studio\19.0\bin\CodeGear.Common.Targets(305,5): error MSB4018:    at Borland.Build.Tasks.Shared.GetItCmd.Execute()
c:\program files (x86)\embarcadero\studio\19.0\bin\CodeGear.Common.Targets(305,5): error MSB4018:    at Microsoft.Build.BuildEngine.TaskEngine.ExecuteInstantiatedTask(EngineProxy engineProxy, ItemBucket bucket, TaskExecutionMode howToExecuteTask, ITask task, Boolean& taskResult)
    1 Warning(s)
    1 Error(s)
Time Elapsed 00:00:00.29

 

본 게시판은 개발자들이 자유롭게 질문과 답변을 공유하는 게시판입니다.
* 따라서 최대한 정중하게 질문을 올려 주세요.
* 질문을 상세히 작성해 주실 수록 좋은 답변이 올라 옵니다.
* 다른 분들도 참고할 수 있도록 결과 댓글 필수(또는 감사 댓글)
(결과 댓글을 달지 않는 경우 다음 질문에 대한 답변이 달리지 않는 불이익이 있을 수 있습니다.)
-----------------------------------------------------------------------------------------------

 

번호 제목 글쓴이 날짜 조회 수
공지 [프로그래밍 강의] 2019.4~2019.7 관리자 2015.01.22 6410
공지 유용한 관련 사이트 관리자2 2014.03.20 43749
공지 본 게시판은 개발자 여러분들의 질문과 답변을 공유하는 공간입니다. 관리자 2012.01.10 85023
1484 델파이 10.2.3 에서 IOS 키입력창 문제 부분 [1] delphiman 2019.01.15 58
1483 [질문]Delphi XE7 Fastreport PDF 한글 깨짐 [1] 라다 2019.01.11 94
1482 TLocationSensor 의 중지가 안됩니다. silkroad99 2019.01.11 38
1481 RTTI로 집합 타입의 내용을 출력하고 싶어요. [1] 험프리 2019.01.08 53
1480 델파이에서 정규식을 어떻게 사용하나요. [1] devdev 2019.01.07 61
1479 RIS TWebBrowser 버그 [3] 아가머하노 2018.12.17 161
1478 안드로이드 8.0이상 즉 신형 스마트폰에서 form의 SaveState는 왜 안먹을까요? 화이부동 2019.01.06 65
1477 rio 10.3 에서 프로젝트 file (.dpr) 편집하는 방법 [1] 닉네임없음 2019.01.03 55
1476 [이벤트 당첨자 발표] 개발자 Q&A 게시판을 가장 잘 활용해주신 개발자는?! 관리자 2019.01.03 56
1475 [연말 이벤트] 개발자 Q&A 게시판을 가장 잘 활용해주신 분 상품 증정 관리자 2018.11.12 142
1474 윈도우10 보안 업데이트 이후 FastReport 출력문제 박군80 2018.12.31 91
1473 Uses Permissions Target [3] file 헌터 2018.12.06 118
1472 델파이 RIO Webbrowser size 문의? [2] silkroad99 2018.12.27 122
1471 Delphi 10.3 리오 rest 컴포넌트 오류 [4] 호호 2018.12.22 153
1470 델파이 Style과 Grid [2] file 크림슨킹 2018.12.27 120
1469 Delphi 10.3 Rio 에서 bpl 프로젝트 설치 문제. [2] 대마왕 2018.12.24 253
1468 디자인타임시 그림파일이 로딩되지 않습니다. 바다를향해 2018.12.26 37
1467 xe 10.3 에서 lib path 연결 하는 방법은 무엇인지요? [2] 김태현 2018.12.26 114
1466 델파이 Note 컴퍼넌트 오류 [1] file 김진석 2018.12.23 93
1465 문자열 관련 [1] 구뚜루 2018.12.25 50



광고 모듈이 설치되어 있지 않아 실행을 중단합니다..