새로운 글
새로운 덧글

자유롭게 질의 및 응답을 할 수 있는 게시판이며 어느 누구도 답변을 달아야만 하는 의무는 없습니다. 
  • 제품설치/등록/제품 오류 문의: 설치/등록 Q&A 이용 (제품 구매 고객 한정)

Checking project dependencies...
Compiling ScannerMapp.dproj (Debug, Win32)
[Warning Warning] Checking GetIt package dependencies
[MSBuild Error] The "GetItCmd" task failed unexpectedly.
System.NullReferenceException: Object reference not set to an instance of an object.
   at Borland.Build.Tasks.Common.CommandLineTask.Execute()
   at Borland.Build.Tasks.Shared.GetItCmd.Execute()
   at Microsoft.Build.BuildEngine.TaskEngine.ExecuteInstantiatedTask(EngineProxy engineProxy, ItemBucket bucket, TaskExecutionMode howToExecuteTask, ITask task, Boolean& taskResult)
Failed
Elapsed time: 00:00:00.9

 

 

Project "D:\SOURCE\MobilePos\ScannerMApp-master\ScannerMApp-master\ScannerMapp.dproj" (Make target(s)):
Target _CheckGetItPackageDependencies:
    Target _ExecGetItCmd:
        c:\program files (x86)\embarcadero\studio\19.0\bin\CodeGear.Common.Targets : warning : Checking GetIt package dependencies
        c:\program files (x86)\embarcadero\studio\19.0\bin\CodeGear.Common.Targets(305,5): error MSB4018: The "GetItCmd" task failed unexpectedly.
        c:\program files (x86)\embarcadero\studio\19.0\bin\CodeGear.Common.Targets(305,5): error MSB4018: System.NullReferenceException: Object reference not set to an instance of an object.
        c:\program files (x86)\embarcadero\studio\19.0\bin\CodeGear.Common.Targets(305,5): error MSB4018:    at Borland.Build.Tasks.Common.CommandLineTask.Execute()
        c:\program files (x86)\embarcadero\studio\19.0\bin\CodeGear.Common.Targets(305,5): error MSB4018:    at Borland.Build.Tasks.Shared.GetItCmd.Execute()
        c:\program files (x86)\embarcadero\studio\19.0\bin\CodeGear.Common.Targets(305,5): error MSB4018:    at Microsoft.Build.BuildEngine.TaskEngine.ExecuteInstantiatedTask(EngineProxy engineProxy, ItemBucket bucket, TaskExecutionMode howToExecuteTask, ITask task, Boolean& taskResult)
    Done building target "_ExecGetItCmd" in project "ScannerMapp.dproj" -- FAILED.
Done building target "_CheckGetItPackageDependencies" in project "ScannerMapp.dproj" -- FAILED.
Done building project "ScannerMapp.dproj" -- FAILED.
Build FAILED.
c:\program files (x86)\embarcadero\studio\19.0\bin\CodeGear.Common.Targets : warning : Checking GetIt package dependencies
c:\program files (x86)\embarcadero\studio\19.0\bin\CodeGear.Common.Targets(305,5): error MSB4018: The "GetItCmd" task failed unexpectedly.
c:\program files (x86)\embarcadero\studio\19.0\bin\CodeGear.Common.Targets(305,5): error MSB4018: System.NullReferenceException: Object reference not set to an instance of an object.
c:\program files (x86)\embarcadero\studio\19.0\bin\CodeGear.Common.Targets(305,5): error MSB4018:    at Borland.Build.Tasks.Common.CommandLineTask.Execute()
c:\program files (x86)\embarcadero\studio\19.0\bin\CodeGear.Common.Targets(305,5): error MSB4018:    at Borland.Build.Tasks.Shared.GetItCmd.Execute()
c:\program files (x86)\embarcadero\studio\19.0\bin\CodeGear.Common.Targets(305,5): error MSB4018:    at Microsoft.Build.BuildEngine.TaskEngine.ExecuteInstantiatedTask(EngineProxy engineProxy, ItemBucket bucket, TaskExecutionMode howToExecuteTask, ITask task, Boolean& taskResult)
    1 Warning(s)
    1 Error(s)
Time Elapsed 00:00:00.29

 

본 게시판은 개발자들이 자유롭게 질문과 답변을 공유하는 게시판입니다.
* 따라서 최대한 정중하게 질문을 올려 주세요.
* 질문을 상세히 작성해 주실 수록 좋은 답변이 올라 옵니다.
* 다른 분들도 참고할 수 있도록 결과 댓글 필수(또는 감사 댓글)
(결과 댓글을 달지 않는 경우 다음 질문에 대한 답변이 달리지 않는 불이익이 있을 수 있습니다.)
-----------------------------------------------------------------------------------------------

 



광고 모듈이 설치되어 있지 않아 실행을 중단합니다..