새로운 글
새로운 덧글

자유롭게 질의 및 응답을 할 수 있는 게시판이며 어느 누구도 답변을 달아야만 하는 의무는 없습니다. 
  • 제품설치/등록/제품 오류 문의: 설치/등록 Q&A 이용 (제품 구매 고객 한정)

Checking project dependencies...
Compiling ScannerMapp.dproj (Debug, Win32)
[Warning Warning] Checking GetIt package dependencies
[MSBuild Error] The "GetItCmd" task failed unexpectedly.
System.NullReferenceException: Object reference not set to an instance of an object.
   at Borland.Build.Tasks.Common.CommandLineTask.Execute()
   at Borland.Build.Tasks.Shared.GetItCmd.Execute()
   at Microsoft.Build.BuildEngine.TaskEngine.ExecuteInstantiatedTask(EngineProxy engineProxy, ItemBucket bucket, TaskExecutionMode howToExecuteTask, ITask task, Boolean& taskResult)
Failed
Elapsed time: 00:00:00.9

 

 

Project "D:\SOURCE\MobilePos\ScannerMApp-master\ScannerMApp-master\ScannerMapp.dproj" (Make target(s)):
Target _CheckGetItPackageDependencies:
    Target _ExecGetItCmd:
        c:\program files (x86)\embarcadero\studio\19.0\bin\CodeGear.Common.Targets : warning : Checking GetIt package dependencies
        c:\program files (x86)\embarcadero\studio\19.0\bin\CodeGear.Common.Targets(305,5): error MSB4018: The "GetItCmd" task failed unexpectedly.
        c:\program files (x86)\embarcadero\studio\19.0\bin\CodeGear.Common.Targets(305,5): error MSB4018: System.NullReferenceException: Object reference not set to an instance of an object.
        c:\program files (x86)\embarcadero\studio\19.0\bin\CodeGear.Common.Targets(305,5): error MSB4018:    at Borland.Build.Tasks.Common.CommandLineTask.Execute()
        c:\program files (x86)\embarcadero\studio\19.0\bin\CodeGear.Common.Targets(305,5): error MSB4018:    at Borland.Build.Tasks.Shared.GetItCmd.Execute()
        c:\program files (x86)\embarcadero\studio\19.0\bin\CodeGear.Common.Targets(305,5): error MSB4018:    at Microsoft.Build.BuildEngine.TaskEngine.ExecuteInstantiatedTask(EngineProxy engineProxy, ItemBucket bucket, TaskExecutionMode howToExecuteTask, ITask task, Boolean& taskResult)
    Done building target "_ExecGetItCmd" in project "ScannerMapp.dproj" -- FAILED.
Done building target "_CheckGetItPackageDependencies" in project "ScannerMapp.dproj" -- FAILED.
Done building project "ScannerMapp.dproj" -- FAILED.
Build FAILED.
c:\program files (x86)\embarcadero\studio\19.0\bin\CodeGear.Common.Targets : warning : Checking GetIt package dependencies
c:\program files (x86)\embarcadero\studio\19.0\bin\CodeGear.Common.Targets(305,5): error MSB4018: The "GetItCmd" task failed unexpectedly.
c:\program files (x86)\embarcadero\studio\19.0\bin\CodeGear.Common.Targets(305,5): error MSB4018: System.NullReferenceException: Object reference not set to an instance of an object.
c:\program files (x86)\embarcadero\studio\19.0\bin\CodeGear.Common.Targets(305,5): error MSB4018:    at Borland.Build.Tasks.Common.CommandLineTask.Execute()
c:\program files (x86)\embarcadero\studio\19.0\bin\CodeGear.Common.Targets(305,5): error MSB4018:    at Borland.Build.Tasks.Shared.GetItCmd.Execute()
c:\program files (x86)\embarcadero\studio\19.0\bin\CodeGear.Common.Targets(305,5): error MSB4018:    at Microsoft.Build.BuildEngine.TaskEngine.ExecuteInstantiatedTask(EngineProxy engineProxy, ItemBucket bucket, TaskExecutionMode howToExecuteTask, ITask task, Boolean& taskResult)
    1 Warning(s)
    1 Error(s)
Time Elapsed 00:00:00.29

 

본 게시판은 개발자들이 자유롭게 질문과 답변을 공유하는 게시판입니다.
* 따라서 최대한 정중하게 질문을 올려 주세요.
* 질문을 상세히 작성해 주실 수록 좋은 답변이 올라 옵니다.
* 다른 분들도 참고할 수 있도록 결과 댓글 필수(또는 감사 댓글)
(결과 댓글을 달지 않는 경우 다음 질문에 대한 답변이 달리지 않는 불이익이 있을 수 있습니다.)
-----------------------------------------------------------------------------------------------

 

번호 제목 글쓴이 날짜 조회 수
공지 [프로그래밍 강의] 2019.8~2019.12 관리자 2015.01.22 6454
공지 유용한 관련 사이트 관리자2 2014.03.20 43800
공지 본 게시판은 개발자 여러분들의 질문과 답변을 공유하는 공간입니다. 관리자 2012.01.10 85028
387 Generator를 변수로 변경할 수있을까요? [1] 아폴로 2018.07.13 52
386 안드로이드 앱 컴파일 시 오류 준호승호 2018.07.16 512
385 알람앱 만들기 질문드립니다. [2] 루피 2018.07.17 128
384 델파이 도쿄버전 디자인 폼 버튼 스타일을 델파이 7으로 변경 [2] file 신우 2018.07.18 198
383 RawByteString 클래스 사용이 안됩니다 [1] 손보라 2018.07.19 78
382 안녕하세요 현재 고2 논문작성하는데 개발자 소스코드+조언 부탁드려도될까요 ㅠㅠ [2] 브루스너구링 2018.07.22 278
381 파이어닥 관련하여 궁금점이 있습니다. [1] 이즈로즈 2018.07.24 98
380 모바일 앱개발 기술지원요청 [2] 파란김치 2018.07.25 95
379 pc 에서 android 로 파일전송 질문 [2] 루피 2018.07.26 82
378 c++ builder vcl form에서 패널 마우스업 다운 질문있습니다.(좌클릭, 우클릭) 빌더에러좀... 2018.07.27 82
377 상위버전에서 지원하는 REST.JSON 또는 System.JSON 을 사용할 수 있을까요? [2] 도의 2018.07.27 78
376 Delphi와 C++Builder를 하나의 컴퓨터에 동시에 설치할 수 있나요? [3] file 얼짱나 2018.07.30 120
375 오라클 클라이언트를 설치하지 않고 오라클 서버에 접속 할 수 있는 방법이 없나요? [2] 맛재현 2018.07.30 216
374 PointMobileBI07모델 샘플자료 에러입니다. [1] 김종찬 2018.07.30 40
» 오픈소스 scannerMapp 에서 아래와 같은 에러가 나옵니다. [1] 김종찬 2018.07.30 107
372 API 레벨 26 (안드로이드 80) 이상이 적용패치 언제 될까요 [1] silkroad99 2018.07.30 137
371 시간 또는 분을 추가하고 싶어요. 험프리 2018.07.31 67
370 델파이 Query.Reflesh와 DataSource.DataSet.ReFlesh의 차이점은? [1] 스카이 2018.07.31 253
369 object lock not owned. 오류가 나는 원인이 뭔가요?? sihwan 2018.08.03 81
368 펜을 사용하는 앱개발을 하고싶습니다. [1] 100jk 2018.08.06 74



광고 모듈이 설치되어 있지 않아 실행을 중단합니다..